Target
Toll-like receptor 1
Ligand
BDBM50600890
Substrate
Meas. Tech.
ChEMBL_2235376 (CHEMBL5149148)
EC50
0.200000±n/a nM
Citation
 Yang, MHRussell, JLMifune, YWang, YShi, HMoresco, EMYSiegwart, DJBeutler, BBoger, DL Next-Generation Diprovocims with Potent Human and Murine TLR1/TLR2 Agonist Activity That Activate the Innate and Adaptive Immune Response. J Med Chem 65:9230-9252 (2022) Target
Name:
Toll-like receptor 1
Synonyms:
CD_antigen=CD281 TIL TLR1_HUMAN Toll/interleukin-1 receptor-like protein
Type:
PROTEIN
Mol. Mass.:
90298.92
Organism:
Homo sapiens
Description:
ChEMBL_117187
Residue:
786
  
Inhibitor
Name:
BDBM50600890
Synonyms:
CHEMBL5196750
Type:
Small organic molecule
Emp. Form.:
C61H74N6O9
Mol. Mass.:
1035.2751
SMILES:
OCC(=O)OCCCCCCCCCCCCNC(=O)[C@@H]1CN(C[C@H]1C(=O)N[C@H]1C[C@@H]1c1ccccc1)C(=O)c1ccc(cc1)C(=O)N1C[C@H]([C@@H](C1)C(=O)N[C@H]1C[C@@H]1c1ccccc1)C(=O)N[C@H]1C[C@@H]1c1ccccc1
: