Target
Toll-like receptor 1
Ligand
BDBM50600896
Substrate
Meas. Tech.
ChEMBL_2235376 (CHEMBL5149148)
EC50
0.250000±n/a nM
Citation
 Yang, MHRussell, JLMifune, YWang, YShi, HMoresco, EMYSiegwart, DJBeutler, BBoger, DL Next-Generation Diprovocims with Potent Human and Murine TLR1/TLR2 Agonist Activity That Activate the Innate and Adaptive Immune Response. J Med Chem 65:9230-9252 (2022) Target
Name:
Toll-like receptor 1
Synonyms:
CD_antigen=CD281 TIL TLR1_HUMAN Toll/interleukin-1 receptor-like protein
Type:
PROTEIN
Mol. Mass.:
90298.92
Organism:
Homo sapiens
Description:
ChEMBL_117187
Residue:
786
  
Inhibitor
Name:
BDBM50600896
Synonyms:
CHEMBL5183964
Type:
Small organic molecule
Emp. Form.:
C66H77N7O9
Mol. Mass.:
1112.3591
SMILES:
[O-][N+](=O)c1ccc(COCCCCCCCCCCCCNC(=O)[C@@H]2CN(C[C@H]2C(=O)N[C@H]2C[C@@H]2c2ccccc2)C(=O)c2ccc(cc2)C(=O)N2C[C@H]([C@@H](C2)C(=O)N[C@H]2C[C@@H]2c2ccccc2)C(=O)N[C@H]2C[C@@H]2c2ccccc2)cc1
: