Target
Glucagon receptor
Ligand
BDBM50601249
Substrate
Meas. Tech.
ChEMBL_2236075 (CHEMBL5149847)
EC50
0.019000±n/a nM
Citation
 Huang, CPalani, AYang, ZDeng, QReddy, VNargund, RPLin, SAltezza, SBianchi, EOrvieto, FCarrington, P Discovery of Insulin/GLP-1/Glucagon Triagonists for the Treatment of Diabetes and Obesity. ACS Med Chem Lett 13:1255-1261 (2022) Target
Name:
Glucagon receptor
Synonyms:
GCGR GLR_HUMAN Glucagon receptor (GlucR)
Type:
Enzyme
Mol. Mass.:
54026.92
Organism:
Homo sapiens (Human)
Description:
P47871
Residue:
477
  
Inhibitor
Name:
BDBM50601249
Synonyms:
CHEMBL5196728
Type:
Small organic molecule
Emp. Form.:
C177H271N45O55
Mol. Mass.:
3909.3141
SMILES:
CCCCCCCCCCCCCCCC(=O)N[C@@H](CCC(=O)N[C@@H](CCC(=O)NCCCC[C@H](NC(=O)[C@H](CC(O)=O)NC(=O)[C@H](CO)NC(=O)[C@@H](NC(=O)[C@H](Cc1ccccc1)NC(=O)[C@@H](NC(=O)CNC(=O)[C@H](CCC(N)=O)NC(=O)[C@@H](CO)NC(=O)[C@@H](N)Cc1c[nH]cn1)[C@@H](C)O)[C@@H](C)O)C(=O)N[C@@H](CO)C(=O)N[C@@H](CCCCN)C(=O)N[C@@H](Cc1ccc(O)cc1)C(=O)N[C@@H](CC(C)C)C(=O)N[C@@H](CC(O)=O)C(=O)N[C@@H](CCC(O)=O)C(=O)N[C@@H](CCCNC(N)=N)C(=O)N[C@@H](C)C(=O)N[C@@H](C)C(=O)N[C@@H](CCC(N)=O)C(=O)N[C@@H](CC(O)=O)C(=O)N[C@@H](Cc1ccccc1)C(=O)N[C@@H](C(C)C)C(=O)N[C@@H](CCCCN=[N+]=[N-])C(=O)N[C@@H](Cc1c[nH]c2ccccc12)C(=O)N[C@@H](CC(C)C)C(=O)N[C@@H](CC(C)C)C(=O)N[C@@H](CC(O)=O)C(=O)N[C@@H]([C@@H](C)O)C(N)=O)C(O)=O)C(O)=O
: