Target
1-deoxy-D-xylulose 5-phosphate reductoisomerase
Ligand
BDBM50181150
Substrate
Meas. Tech.
ChEMBL_345851 (CHEMBL860877)
IC50
156±n/a nM
Citation
 Haemers, TWiesner, JVan Poecke, SGoeman, JHenschker, DBeck, EJomaa, HVan Calenbergh, S Synthesis of alpha-substituted fosmidomycin analogues as highly potent Plasmodium falciparum growth inhibitors. Bioorg Med Chem Lett 16:1888-91 (2006)  
Target
Name:
1-deoxy-D-xylulose 5-phosphate reductoisomerase
Synonyms:
1-Deoxy-D-xylulose 5-phosphate reductoisomerase (DXP) 1-deoxy-D-xylulose 5-phosphate reductoisomerase (DXR) DXP reductoisomerase dxr yaeM
Type:
Protein
Mol. Mass.:
43384.52
Organism:
Escherichia coli
Description:
P45568
Residue:
398
  
Inhibitor
Name:
BDBM50181150
Synonyms:
3-(N-hydroxyformamido)-1-(4-methoxyphenyl)propylphosphonic acid | CHEMBL205339
Type:
Small organic molecule
Emp. Form.:
C11H16NO6P
Mol. Mass.:
289.2216
SMILES:
COc1ccc(cc1)C(CCN(O)C=O)P(O)(O)=O
: