Target
Dimer of Protein farnesyltransferase subunit beta
Ligand
BDBM50181235
Substrate
Meas. Tech.
ChEMBL_346327 (CHEMBL864973)
IC50
0.72±n/a nM
Citation
 Lee, JKim, JKoh, JSChung, HHKim, KH Hydantoin derivatives as non-peptidic inhibitors of Ras farnesyl transferase. Bioorg Med Chem Lett 16:1954-6 (2006)  
Target
Name:
Dimer of Protein farnesyltransferase subunit beta
Synonyms:
Protein Farnesyltransferase (PFT) Chain B
Type:
Mol. Mass.:
Description:
ASSAY_ID of EBI is 51428
Components:
This complex has 3 components.
Component 1
Name:
Protein farnesyltransferase subunit beta
Synonyms:
CAAX farnesyltransferase subunit alpha FNTB FTase-alpha GGTase-I-alpha Protein farnesyl/geranylgeranyl transferase Protein farnesyltransferase subunit beta Protein farnesyltransferase/geranylgeranyltransferase type-1 subunit alpha Ras proteins prenyltransferase subunit beta | Type I protein geranyl-geranyltransferase subunit alpha
Type:
Enzyme Subunit
Mol. Mass.:
48766.02
Organism:
Homo sapiens (Human)
Description:
Protein farnesyltransferase subunit beta
Residue:
437
  
Component 2
Name:
Protein farnesyltransferase subunit beta
Synonyms:
CAAX farnesyltransferase subunit alpha FNTB FTase-alpha GGTase-I-alpha Protein farnesyl/geranylgeranyl transferase Protein farnesyltransferase subunit beta Protein farnesyltransferase/geranylgeranyltransferase type-1 subunit alpha Ras proteins prenyltransferase subunit beta | Type I protein geranyl-geranyltransferase subunit alpha
Type:
Enzyme Subunit
Mol. Mass.:
48766.02
Organism:
Homo sapiens (Human)
Description:
Protein farnesyltransferase subunit beta
Residue:
437
  
Inhibitor
Name:
BDBM50181235
Synonyms:
3-(3-(1H-imidazol-1-yl)propyl)-1-(3-phenoxybenzyl)-5-methyl-5-(naphthalen-1-yl)imidazolidine-2,4-dione | CHEMBL380451
Type:
Small organic molecule
Emp. Form.:
C33H30N4O3
Mol. Mass.:
530.6163
SMILES:
CC1(N(Cc2cccc(Oc3ccccc3)c2)C(=O)N(CCCn2ccnc2)C1=O)c1cccc2ccccc12
: