Target
Dimer of Protein farnesyltransferase subunit beta
Ligand
BDBM50181247
Substrate
Meas. Tech.
ChEMBL_346327 (CHEMBL864973)
IC50
0.73±n/a nM
Citation
 Lee, JKim, JKoh, JSChung, HHKim, KH Hydantoin derivatives as non-peptidic inhibitors of Ras farnesyl transferase. Bioorg Med Chem Lett 16:1954-6 (2006)  
Target
Name:
Dimer of Protein farnesyltransferase subunit beta
Synonyms:
Protein Farnesyltransferase (PFT) Chain B
Type:
Mol. Mass.:
Description:
ASSAY_ID of EBI is 51428
Components:
This complex has 3 components.
Component 1
Name:
Protein farnesyltransferase subunit beta
Synonyms:
CAAX farnesyltransferase subunit alpha FNTB FTase-alpha GGTase-I-alpha Protein farnesyl/geranylgeranyl transferase Protein farnesyltransferase subunit beta Protein farnesyltransferase/geranylgeranyltransferase type-1 subunit alpha Ras proteins prenyltransferase subunit beta | Type I protein geranyl-geranyltransferase subunit alpha
Type:
Enzyme Subunit
Mol. Mass.:
48766.02
Organism:
Homo sapiens (Human)
Description:
Protein farnesyltransferase subunit beta
Residue:
437
  
Component 2
Name:
Protein farnesyltransferase subunit beta
Synonyms:
CAAX farnesyltransferase subunit alpha FNTB FTase-alpha GGTase-I-alpha Protein farnesyl/geranylgeranyl transferase Protein farnesyltransferase subunit beta Protein farnesyltransferase/geranylgeranyltransferase type-1 subunit alpha Ras proteins prenyltransferase subunit beta | Type I protein geranyl-geranyltransferase subunit alpha
Type:
Enzyme Subunit
Mol. Mass.:
48766.02
Organism:
Homo sapiens (Human)
Description:
Protein farnesyltransferase subunit beta
Residue:
437
  
Inhibitor
Name:
BDBM50181247
Synonyms:
5-((3-(3-(1H-imidazol-1-yl)propyl)-5-methyl-5-(naphthalen-1-yl)-2,4-dioxoimidazolidin-1-yl)methyl)-2-(methylsulfonyl)benzonitrile | CHEMBL380615
Type:
Small organic molecule
Emp. Form.:
C29H27N5O4S
Mol. Mass.:
541.621
SMILES:
CC1(N(Cc2ccc(c(c2)C#N)S(C)(=O)=O)C(=O)N(CCCn2ccnc2)C1=O)c1cccc2ccccc12
: