Target
Muscarinic acetylcholine receptor M2
Ligand
BDBM50601574
Substrate
Meas. Tech.
ChEMBL_2237594 (CHEMBL5151490)
Kd
0.100000±n/a nM
Citation
 Tropmann, KBresinsky, MForster, LMönnich, DBuschauer, AWittmann, HJHübner, HGmeiner, PPockes, SStrasser, A Abolishing Dopamine D J Med Chem 64:8684-8709 (2021) Target
Name:
Muscarinic acetylcholine receptor M2
Synonyms:
ACM2_HUMAN Cholinergic, muscarinic M2 Muscarinic acetylcholine receptor M2 and M5 | RecName: Full=Muscarinic acetylcholine receptor M2
Type:
GPCR
Mol. Mass.:
51730.61
Organism:
Homo sapiens (Human)
Description:
P08172
Residue:
466
  
Inhibitor
Name:
BDBM50601574
Synonyms:
CHEMBL5201074
Type:
Small organic molecule
Emp. Form.:
C15H23Cl2N7O
Mol. Mass.:
388.295
SMILES:
Cl.Cl.C[C@@H](NC(=O)\N=C(/N)NCCCc1ncn[nH]1)c1ccccc1
: