Target
Mu-type opioid receptor
Ligand
BDBM50601551
Substrate
Meas. Tech.
ChEMBL_2237601 (CHEMBL5151497)
Kd
0.090000±n/a nM
Citation
 Tropmann, KBresinsky, MForster, LMönnich, DBuschauer, AWittmann, HJHübner, HGmeiner, PPockes, SStrasser, A Abolishing Dopamine D J Med Chem 64:8684-8709 (2021) Target
Name:
Mu-type opioid receptor
Synonyms:
M-OR-1 MOR-1 MUOR1 Mu opiate receptor OPRM1 hMOP | mu-type opioid receptor isoform MOR-1
Type:
G Protein-Coupled Receptor (GPCR)
Mol. Mass.:
44789.51
Organism:
Homo sapiens (Human)
Description:
P35372
Residue:
400
  
Inhibitor
Name:
BDBM50601551
Synonyms:
CHEMBL5207281
Type:
Small organic molecule
Emp. Form.:
C16H25F6N7O5S
Mol. Mass.:
541.469
SMILES:
OC(=O)C(F)(F)F.OC(=O)C(F)(F)F.CCCCCNC(=O)\N=C(/N)NCCCc1nnc(N)s1
: