Target
Tyrosine-protein phosphatase non-receptor type 1
Ligand
BDBM50182131
Substrate
Meas. Tech.
ChEMBL_347009 (CHEMBL864995)
Ki
32000±n/a nM
Citation
 Ahmad, GMishra, PKGupta, PYadav, PPTiwari, PTamrakar, AKSrivastava, AKMaurya, R Synthesis of novel benzofuran isoxazolines as protein tyrosine phosphatase 1B inhibitors. Bioorg Med Chem Lett 16:2139-43 (2006)  
Target
Name:
Tyrosine-protein phosphatase non-receptor type 1
Synonyms:
PTN1_HUMAN PTPN1 Protein tyrosine phosphatase-1B (PTP1B) Protein-tyrosine phosphatase 1B (PTP1B) Tyrosine-protein phosphatase non-receptor type 1 (PTP1B)
Type:
Protein phosphatase
Mol. Mass.:
49963.76
Organism:
Homo sapiens (Human)
Description:
Human recombinant GST-fusion PTP1B (1-435).
Residue:
435
  
Inhibitor
Name:
BDBM50182131
Synonyms:
3-(4,7-dimethoxybenzofuran-5-yl)-5-(4-methoxyphenyl)-4,5-dihydroisoxazole | CHEMBL377439
Type:
Small organic molecule
Emp. Form.:
C20H19NO5
Mol. Mass.:
353.3686
SMILES:
COc1ccc(cc1)C1CC(=NO1)c1cc(OC)c2occc2c1OC
: