Target
Histone deacetylase 7
Ligand
BDBM50563276
Substrate
Meas. Tech.
ChEMBL_2241959 (CHEMBL5156169)
IC50
7.7±n/a nM
Citation
 Turkman, NLiu, DPirola, I Design, synthesis, biochemical evaluation, radiolabeling and in vivo imaging with high affinity class-IIa histone deacetylase inhibitor for molecular imaging and targeted therapy. Eur J Med Chem 228:0 (2022) Target
Name:
Histone deacetylase 7
Synonyms:
HD7 HDAC7A Histone acetylase 7 (HDAC7) Human HDAC7
Type:
Chromatin regulator; hydrolase; repressor
Mol. Mass.:
102942.62
Organism:
Homo sapiens (Human)
Description:
Q8WUI4
Residue:
952
  
Inhibitor
Name:
BDBM50563276
Synonyms:
CHEMBL4751615
Type:
Small organic molecule
Emp. Form.:
C23H19F3N4O3
Mol. Mass.:
456.4172
SMILES:
CC(C)(CNC(=O)c1cccc(c1)-c1noc(n1)C(F)(F)F)c1coc(n1)-c1ccccc1
: