Target
Aurora kinase A
Ligand
BDBM50004205
Substrate
Meas. Tech.
ChEMBL_2244801 (CHEMBL5159011)
IC50
0.600000±n/a nM
Citation
 Bijian, KWernic, DNivedha, AKSu, JLim, FPLMiron, CEAmzil, HMoitessier, NAlaoui-Jamali, MA Novel Aurora A and Protein Kinase C (?, ?1, ?2, and ?) Multitarget Inhibitors: Impact of Selenium Atoms on the Potency and Selectivity. J Med Chem 65:3134-3150 (2022) Target
Name:
Aurora kinase A
Synonyms:
AIK ARK-1 AURA AURKA_HUMAN Aurora 2 Aurora kinase A (AURKA) Aurora kinase A (Aurora-2) Aurora/IPL1-related kinase 1 Breast tumor-amplified kinase IAK1 STK15 GN Serine/threonine kinase 15 Serine/threonine-protein kinase 6 Serine/threonine-protein kinase aurora-A aurora-2 | hARK1
Type:
Serine/threonine-protein kinase
Mol. Mass.:
45830.98
Organism:
Homo sapiens (Human)
Description:
O14965
Residue:
403
  
Inhibitor
Name:
BDBM50004205
Synonyms:
MK-045 TOZASERTIB VX-68 | VX-680
Type:
Small organic molecule
Emp. Form.:
C23H28N8OS
Mol. Mass.:
464.586
SMILES:
CN1CCN(CC1)c1cc(Nc2cc(C)[nH]n2)nc(Sc2ccc(NC(=O)C3CC3)cc2)n1
: