Target
Cruzipain
Ligand
BDBM50602543
Substrate
Meas. Tech.
ChEMBL_2245278 (CHEMBL5159488)
IC50
1.1±n/a nM
Citation
 Barbosa Da Silva, ESharma, VHernandez-Alvarez, LTang, AHStoye, AO'Donoghue, AJGerwick, WHPayne, RJMcKerrow, JHPodust, LM Intramolecular Interactions Enhance the Potency of Gallinamide A Analogues against  J Med Chem 65:4255-4269 (2022) Target
Name:
Cruzipain
Synonyms:
CYSP_TRYCR Cruzaine | Major cysteine proteinase
Type:
Protein
Mol. Mass.:
49831.41
Organism:
Trypanosoma cruzi
Description:
P25779
Residue:
467
  
Inhibitor
Name:
BDBM50602543
Synonyms:
CHEMBL4598338
Type:
Small organic molecule
Emp. Form.:
C45H60N6O6
Mol. Mass.:
780.9945
SMILES:
COC1=CC(=O)N([C@H]1Cc1c[nH]c2ccccc12)C(=O)\C=C\[C@H](C)NC(=O)[C@H](CCc1ccccc1)NC(=O)[C@H](CC1CCCCC1)NC(=O)[C@H](C(C)C)N(C)C
: