Target
Cruzipain
Ligand
BDBM50603794
Substrate
Meas. Tech.
ChEMBL_2245278 (CHEMBL5159488)
IC50
0.110000±n/a nM
Citation
 Barbosa Da Silva, ESharma, VHernandez-Alvarez, LTang, AHStoye, AO'Donoghue, AJGerwick, WHPayne, RJMcKerrow, JHPodust, LM Intramolecular Interactions Enhance the Potency of Gallinamide A Analogues against  J Med Chem 65:4255-4269 (2022) Target
Name:
Cruzipain
Synonyms:
CYSP_TRYCR Cruzaine | Major cysteine proteinase
Type:
Protein
Mol. Mass.:
49831.41
Organism:
Trypanosoma cruzi
Description:
P25779
Residue:
467
  
Inhibitor
Name:
BDBM50603794
Synonyms:
CHEMBL5184737
Type:
Small organic molecule
Emp. Form.:
C50H64N6O6
Mol. Mass.:
845.0798
SMILES:
COC1=CC(=O)N(C1Cc1ccc(cc1)-c1ccc(cc1)C#N)C(=O)\C=C\[C@@H](CCc1ccccc1)NC(=O)[C@H](CC(C)C)NC(=O)[C@H](CC(C)C)NC(=O)[C@H](C(C)C)N(C)C
: