Target
Beta-glucosidase
Ligand
BDBM50185227
Substrate
Meas. Tech.
ChEMBL_359898 (CHEMBL854292)
Ki
58000±n/a nM
Citation
 Pearson, MSSaad, RODintinger, TAmri, HMathé-Allainmat, MLebreton, J Flexible synthesis and biological evaluation of novel 5-deoxyadenophorine analogues. Bioorg Med Chem Lett 16:3262-7 (2006)  
Target
Name:
Beta-glucosidase
Synonyms:
Type:
PROTEIN
Mol. Mass.:
60428.49
Organism:
Prunus avium
Description:
ChEMBL_37428
Residue:
531
  
Inhibitor
Name:
BDBM50185227
Synonyms:
(2R,3S,4S,6R)-2-(hydroxymethyl)-6-undecylpiperidine-3,4-diol | CHEMBL207359
Type:
Small organic molecule
Emp. Form.:
C17H35NO3
Mol. Mass.:
301.4647
SMILES:
CCCCCCCCCCC[C@@H]1C[C@H](O)[C@@H](O)[C@@H](CO)N1
: