Target
Cholecystokinin receptor type A
Ligand
BDBM50185260
Substrate
Meas. Tech.
ChEMBL_343639 (CHEMBL860998)
IC50
4000±n/a nM
Citation
 De Luca, SSaviano, MLassiani, LYannakopoulou, KStefanidou, PAloj, LMorelli, GVarnavas, A Anthranilic acid based CCK1 receptor antagonists and CCK-8 have a common step in their"receptor desmodynamic processes". J Med Chem 49:2456-62 (2006)  
Target
Name:
Cholecystokinin receptor type A
Synonyms:
CCK-A receptor CCK1-R CCKAR_HUMAN Cholecystokinin receptor Cholecystokinin-1 Receptor
Type:
G Protein-Coupled Receptor (GPCR)
Mol. Mass.:
47859.34
Organism:
Homo sapiens (Human)
Description:
Stable expression of human CCK-1 receptors in HEK 293 cells.
Residue:
428
  
Inhibitor
Name:
BDBM50185260
Synonyms:
(+/-)-2-(2-cinnamamidobenzamido)-3-phenylpropanoic acid CHEMBL377157
Type:
Small organic molecule
Emp. Form.:
C25H22N2O4
Mol. Mass.:
414.4532
SMILES:
OC(=O)C(Cc1ccccc1)NC(=O)c1ccccc1NC(=O)\C=C\c1ccccc1
: