Target
Cholecystokinin receptor type A
Ligand
BDBM50185261
Substrate
Meas. Tech.
ChEMBL_343639 (CHEMBL860998)
IC50
195±n/a nM
Citation
 De Luca, SSaviano, MLassiani, LYannakopoulou, KStefanidou, PAloj, LMorelli, GVarnavas, A Anthranilic acid based CCK1 receptor antagonists and CCK-8 have a common step in their"receptor desmodynamic processes". J Med Chem 49:2456-62 (2006)  
Target
Name:
Cholecystokinin receptor type A
Synonyms:
CCK-A receptor CCK1-R CCKAR_HUMAN Cholecystokinin receptor Cholecystokinin-1 Receptor
Type:
G Protein-Coupled Receptor (GPCR)
Mol. Mass.:
47859.34
Organism:
Homo sapiens (Human)
Description:
Stable expression of human CCK-1 receptors in HEK 293 cells.
Residue:
428
  
Inhibitor
Name:
BDBM50185261
Synonyms:
4-(3,4-dichlorobenzamido)-5-((3-methoxypropyl)(pentyl)amino)-5-oxopentanoic acid LOXIGLUMIDE
Type:
Small organic molecule
Emp. Form.:
C21H30Cl2N2O5
Mol. Mass.:
461.379
SMILES:
CCCCCN(CCCOC)C(=O)C(CCC(O)=O)NC(=O)c1ccc(Cl)c(Cl)c1
: