Target
Cholecystokinin receptor type A
Ligand
BDBM50185263
Substrate
Meas. Tech.
ChEMBL_343639 (CHEMBL860998)
IC50
12700±n/a nM
Citation
 De Luca, SSaviano, MLassiani, LYannakopoulou, KStefanidou, PAloj, LMorelli, GVarnavas, A Anthranilic acid based CCK1 receptor antagonists and CCK-8 have a common step in their"receptor desmodynamic processes". J Med Chem 49:2456-62 (2006)  
Target
Name:
Cholecystokinin receptor type A
Synonyms:
CCK-A receptor CCK1-R CCKAR_HUMAN Cholecystokinin receptor Cholecystokinin-1 Receptor
Type:
G Protein-Coupled Receptor (GPCR)
Mol. Mass.:
47859.34
Organism:
Homo sapiens (Human)
Description:
Stable expression of human CCK-1 receptors in HEK 293 cells.
Residue:
428
  
Inhibitor
Name:
BDBM50185263
Synonyms:
2(R,S)-{2-[(2-acetylaminocinnamoyl)amino]benzoylamino}-3-phenylpropionic acid | CHEMBL208171
Type:
Small organic molecule
Emp. Form.:
C27H25N3O5
Mol. Mass.:
471.5045
SMILES:
CC(=O)N\C(=C\c1ccccc1)C(=O)Nc1ccccc1C(=O)NC(Cc1ccccc1)C(O)=O
: