Target
Glutathione S-transferase P
Ligand
BDBM50186229
Substrate
Meas. Tech.
ChEMBL_366183 (CHEMBL853398)
IC50
704±n/a nM
Citation
 Maeda, DYMahajan, SSAtkins, WMZebala, JA Bivalent inhibitors of glutathione S-transferase: the effect of spacer length on isozyme selectivity. Bioorg Med Chem Lett 16:3780-3 (2006)  
Target
Name:
Glutathione S-transferase P
Synonyms:
FAEES3 GST3 GSTP1-1 Glutathione S-transferase Glutathione S-transferase P Glutathione transferase (GST)
Type:
Enzyme
Mol. Mass.:
23353.53
Organism:
Homo sapiens (Human)
Description:
P09211
Residue:
210
  
Inhibitor
Name:
BDBM50186229
Synonyms:
3,5-bis((2-(2-(2,3-dichloro-4-(2-methylenebutanoyl)phenoxy)acetamido)acetamido)methyl)benzamide | CHEMBL212685
Type:
Small organic molecule
Emp. Form.:
C39H39Cl4N5O9
Mol. Mass.:
863.567
SMILES:
CCC(=C)C(=O)c1ccc(OCC(=O)NCC(=O)NCc2cc(CNC(=O)CNC(=O)COc3ccc(C(=O)C(=C)CC)c(Cl)c3Cl)cc(c2)C(N)=O)c(Cl)c1Cl
: