Target
alpha-1,2-Mannosidase
Ligand
BDBM50186732
Substrate
Meas. Tech.
ChEMBL_353423 (CHEMBL861357)
pH
6.8±n/a
Ki
>1000000±n/a nM
Comments
extracted
Citation
 Wang, RWQiu, XLBols, MOrtega-Caballero, FQing, FL Synthesis and biological evaluation of glycosidase inhibitors: gem-difluoromethylenated nojirimycin analogues. J Med Chem 49:2989-97 (2006)  
Target
Name:
alpha-1,2-Mannosidase
Synonyms:
Alpha-mannosidase
Type:
PROTEIN
Mol. Mass.:
65344.50
Organism:
Glycine max
Description:
ChEMBL_32380
Residue:
578
  
Inhibitor
Name:
BDBM50186732
Synonyms:
CHEMBL206628 | D-1,4,6-trideoxy-4,4-difluoronojirimycin
Type:
Small organic molecule
Emp. Form.:
C6H11F2NO2
Mol. Mass.:
167.1538
SMILES:
C[C@H]1NC[C@H](O)[C@@H](O)C1(F)F
: