Target
Adenosine receptor A1
Ligand
BDBM50186977
Substrate
Meas. Tech.
ChEMBL_376054 (CHEMBL864808)
IC50
152±n/a nM
Citation
 Esteve, CNueda, ADíaz, JLBeleta, JCárdenas, ALozoya, ECadavid, MILoza, MIRyder, HVidal, B New pyrrolopyrimidin-6-yl benzenesulfonamides: potent A2B adenosine receptor antagonists. Bioorg Med Chem Lett 16:3642-5 (2006)  
Target
Name:
Adenosine receptor A1
Synonyms:
A1 adenosine receptor (hA1) AA1R_HUMAN ADORA1 Adenosine A1-receptor Adenosine receptor A1 (hA1) | Adenosine transporter (AdT)
Type:
G Protein-Coupled Receptor (GPCR)
Mol. Mass.:
36520.92
Organism:
Homo sapiens (Human)
Description:
P30542
Residue:
326
  
Inhibitor
Name:
BDBM50186977
Synonyms:
6-(4-(4-(3-fluorobenzyl)piperazin-1-ylsulfonyl)phenyl)-1,3-dimethyl-1H-pyrrolo[3,2-d]pyrimidine-2,4(3H,5H)-dione | CHEMBL210383
Type:
Small organic molecule
Emp. Form.:
C25H26FN5O4S
Mol. Mass.:
511.568
SMILES:
Cn1c2cc([nH]c2c(=O)n(C)c1=O)-c1ccc(cc1)S(=O)(=O)N1CCN(Cc2cccc(F)c2)CC1
: