Target
Galectin-4
Ligand
BDBM50605163
Substrate
Meas. Tech.
ChEMBL_2250676 (CHEMBL5164886)
Kd
1400000±n/a nM
Citation
 Bum-Erdene, KCollins, PMHugo, MWTarighat, SSFei, FKishor, CLeffler, HNilsson, UJGroffen, JGrice, IDHeisterkamp, NBlanchard, H Novel Selective Galectin-3 Antagonists Are Cytotoxic to Acute Lymphoblastic Leukemia. J Med Chem 65:5975-5989 (2022) Target
Name:
Galectin-4
Synonyms:
Antigen NY-CO-27 L-36 lactose-binding protein LEG4_HUMAN Lactose-binding lectin 4
Type:
PROTEIN
Mol. Mass.:
35952.28
Organism:
Homo sapiens (Human)
Description:
ChEMBL_716454
Residue:
323
  
Inhibitor
Name:
BDBM50605163
Synonyms:
CHEMBL5193025
Type:
Small organic molecule
Emp. Form.:
C23H22F3NO10
Mol. Mass.:
529.4167
SMILES:
CO[C@@H]1O[C@H](CO)[C@H](O)[C@H](OC(=O)c2ccc(C)cc2)[C@@H]1OC(=O)c1ccc(cc1[N+]([O-])=O)C(F)(F)F
: