Target
Advanced glycosylation end product-specific receptor
Ligand
BDBM50249580
Substrate
Meas. Tech.
ChEMBL_2250937 (CHEMBL5165147)
Kd
13±n/a nM
Citation
 Zhang, CWang, LXu, YHuang, YHuang, JZhu, JWang, WLi, WSun, ALi, XZhang, HLi, J Discovery of novel dual RAGE/SERT inhibitors for the potential treatment of the comorbidity of Alzheimer's disease and depression. Eur J Med Chem 236:0 (2022) Target
Name:
Advanced glycosylation end product-specific receptor
Synonyms:
AGER RAGE_HUMAN | Receptor for advanced glycosylation end products
Type:
PROTEIN
Mol. Mass.:
42800.11
Organism:
Homo sapiens (Human)
Description:
ChEMBL_1339877
Residue:
404
  
Inhibitor
Name:
BDBM50249580
Synonyms:
Azeliragon TTP448 | US11524942, Compound I
Type:
Small organic molecule
Emp. Form.:
C32H38ClN3O2
Mol. Mass.:
532.116
SMILES:
CCCCc1nc(cn1-c1ccc(Oc2ccc(Cl)cc2)cc1)-c1ccc(OCCCN(CC)CC)cc1
: