Target
Integrase
Ligand
BDBM50187770
Substrate
Meas. Tech.
ChEMBL_378127 (CHEMBL869776)
IC50
33±n/a nM
Citation
 Metobo, SEJin, HTsiang, MKim, CU Design, synthesis, and biological evaluation of novel tricyclic HIV-1 integrase inhibitors by modification of its pyridine ring. Bioorg Med Chem Lett 16:3985-8 (2006)  
Target
Name:
Integrase
Synonyms:
Human immunodeficiency virus type 1 integrase
Type:
PROTEIN
Mol. Mass.:
32231.48
Organism:
Human immunodeficiency virus 1
Description:
ChEMBL_90865
Residue:
288
  
Inhibitor
Name:
BDBM50187770
Synonyms:
7-(4-fluorobenzyl)-9-hydroxy-8-oxo-7,8-dihydro-6H-pyrrolo[3,4-g]quinoxalin-5-yl dimethylsulfamate | CHEMBL212982
Type:
Small organic molecule
Emp. Form.:
C19H17FN4O5S
Mol. Mass.:
432.425
SMILES:
CN(C)S(=O)(=O)Oc1c2CN(Cc3ccc(F)cc3)C(=O)c2c(O)c2nccnc12
: