Target
Melanocortin receptor 3
Ligand
BDBM50189025
Substrate
Meas. Tech.
ChEMBL_395994 (CHEMBL910339)
Ki
3.3±n/a nM
Citation
 Tian, XMishra, RKSwitzer, AGHu, XEKim, NMazur, AWEbetino, FHWos, JACrossdoersen, DPinney, BBFarmer, JASheldon, RJ Design and synthesis of potent and selective 1,3,4-trisubstituted-2-oxopiperazine based melanocortin-4 receptor agonists. Bioorg Med Chem Lett 16:4668-73 (2006)  
Target
Name:
Melanocortin receptor 3
Synonyms:
MC3-R MC3R_HUMAN Melanocortin receptor (M3 and M4)
Type:
Enzyme
Mol. Mass.:
36044.86
Organism:
Homo sapiens (Human)
Description:
P41968
Residue:
323
  
Inhibitor
Name:
BDBM50189025
Synonyms:
(S)-2-acetamido-N1-((R)-3-(4-fluorophenyl)-1-((S)-2-(3-guanidinopropyl)-4-((S)-1-(methylamino)-3-(naphthalen-2-yl)-1-oxopropan-2-yl)-3-oxopiperazin-1-yl)-1-oxopropan-2-yl)pentanediamide | CHEMBL215833
Type:
Small organic molecule
Emp. Form.:
C38H48FN9O6
Mol. Mass.:
745.8428
SMILES:
CNC(=O)[C@H](Cc1ccc2ccccc2c1)N1CCN([C@@H](CCCNC(N)=N)C1=O)C(=O)[C@@H](Cc1ccc(F)cc1)NC(=O)[C@H](CCC(N)=O)NC(C)=O
: