Target
Lysine-specific demethylase 6A
Ligand
BDBM50396018
Substrate
Meas. Tech.
ChEMBL_2261088 (CHEMBL5216099)
IC50
200±n/a nM
Citation
 Shishodia, SDemetriades, MZhang, DTam, NYMaheswaran, PClunie-O'Connor, CTumber, ALeung, IKHNg, YMLeissing, TMEl-Sagheer, AHSalah, EBrown, TAik, WSMcDonough, MASchofield, CJ Structure-Based Design of Selective Fat Mass and Obesity Associated Protein (FTO) Inhibitors. J Med Chem 64:16609-16625 (2021) Target
Name:
Lysine-specific demethylase 6A
Synonyms:
Histone demethylase UTX KDM6A_HUMAN Lysine-specific demethylase 6A (KDM6A(UTX)) UTX Ubiquitously-transcribed X chromosome tetratricopeptide repeat protein
Type:
Protein
Mol. Mass.:
154198.48
Organism:
Homo sapiens (Human)
Description:
O15550
Residue:
1401
  
Inhibitor
Name:
BDBM50396018
Synonyms:
CHEMBL1230640
Type:
Small organic molecule
Emp. Form.:
C10H7NO3
Mol. Mass.:
189.1675
SMILES:
OC(=O)c1ccc(O)c2ncccc12
: