Target
Epidermal growth factor receptor
Ligand
BDBM50189998
Substrate
Meas. Tech.
ChEMBL_401654 (CHEMBL856356)
IC50
9±n/a nM
Citation
 Ballard, PBradbury, RHHarris, CSHennequin, LFHickinson, MKettle, JGKendrew, JKlinowska, TOgilvie, DJPearson, SEWilliams, EJWilson, I Inhibitors of epidermal growth factor receptor tyrosine kinase: optimisation of potency and in vivo pharmacokinetics. Bioorg Med Chem Lett 16:4908-12 (2006)  
Target
Name:
Epidermal growth factor receptor
Synonyms:
EGF Receptor Substrate EGFR_HUMAN ERBB1 Epidermal Growth Factor Receptor erbB-1 Epidermal growth factor receptor (EGFR) HER1 Proto-oncogene c-ErbB-1 Tyrosine-Protein Kinase ErbB-1
Type:
Receptor Kinase Domain
Mol. Mass.:
134279.59
Organism:
Homo sapiens (Human)
Description:
P00533
Residue:
1210
  
Inhibitor
Name:
BDBM50189998
Synonyms:
CHEMBL385471 | N-(5-chloro-2-fluorophenyl)-7-methoxy-6-((1-methylpiperidin-4-yl)methoxy)quinazolin-4-amine
Type:
Small organic molecule
Emp. Form.:
C22H24ClFN4O2
Mol. Mass.:
430.903
SMILES:
COc1cc2ncnc(Nc3cc(Cl)ccc3F)c2cc1OCC1CCN(C)CC1
: