Target
Epidermal growth factor receptor
Ligand
BDBM50189992
Substrate
Meas. Tech.
ChEMBL_401654 (CHEMBL856356)
IC50
18±n/a nM
Citation
 Ballard, PBradbury, RHHarris, CSHennequin, LFHickinson, MKettle, JGKendrew, JKlinowska, TOgilvie, DJPearson, SEWilliams, EJWilson, I Inhibitors of epidermal growth factor receptor tyrosine kinase: optimisation of potency and in vivo pharmacokinetics. Bioorg Med Chem Lett 16:4908-12 (2006)  
Target
Name:
Epidermal growth factor receptor
Synonyms:
EGF Receptor Substrate EGFR_HUMAN ERBB1 Epidermal Growth Factor Receptor erbB-1 Epidermal growth factor receptor (EGFR) HER1 Proto-oncogene c-ErbB-1 Tyrosine-Protein Kinase ErbB-1
Type:
Receptor Kinase Domain
Mol. Mass.:
134279.59
Organism:
Homo sapiens (Human)
Description:
P00533
Residue:
1210
  
Inhibitor
Name:
BDBM50189992
Synonyms:
CHEMBL385479 | N-(3-chloro-2-fluorophenyl)-7-methoxy-6-(3-morpholinopropoxy)quinazolin-4-amine
Type:
Small organic molecule
Emp. Form.:
C22H24ClFN4O3
Mol. Mass.:
446.902
SMILES:
COc1cc2ncnc(Nc3cccc(Cl)c3F)c2cc1OCCCN1CCOCC1
: