Target
Low molecular weight phosphotyrosine protein phosphatase
Ligand
BDBM50607110
Substrate
Meas. Tech.
ChEMBL_2262140 (CHEMBL5217151)
IC50
62±n/a nM
Citation
 He, RWang, JYu, ZHMoyers, JSMichael, MDDurham, TBCramer, JWQian, YLin, AWu, LNoinaj, NBarrett, DGZhang, ZY Structure-Based Design of Active-Site-Directed, Highly Potent, Selective, and Orally Bioavailable Low-Molecular-Weight Protein Tyrosine Phosphatase Inhibitors. J Med Chem 65:13892-13909 (2022) Target
Name:
Low molecular weight phosphotyrosine protein phosphatase
Synonyms:
Acp1 LMW-PTPase Low molecular weight phosphotyrosine protein phosphatase | PPAC_MOUSE
Type:
PROTEIN
Mol. Mass.:
18192.04
Organism:
Mus musculus
Description:
ChEMBL_109834
Residue:
158
  
Inhibitor
Name:
BDBM50607110
Synonyms:
CHEMBL5219519
Type:
Small organic molecule
Emp. Form.:
C9H9Br2NO4S
Mol. Mass.:
387.045
SMILES:
Cc1c(Br)cc(NC(=O)CS(O)(=O)=O)cc1Br
: