Target
Low molecular weight phosphotyrosine protein phosphatase
Ligand
BDBM50607112
Substrate
Meas. Tech.
ChEMBL_2262188 (CHEMBL5217199)
IC50
36±n/a nM
Citation
 He, RWang, JYu, ZHMoyers, JSMichael, MDDurham, TBCramer, JWQian, YLin, AWu, LNoinaj, NBarrett, DGZhang, ZY Structure-Based Design of Active-Site-Directed, Highly Potent, Selective, and Orally Bioavailable Low-Molecular-Weight Protein Tyrosine Phosphatase Inhibitors. J Med Chem 65:13892-13909 (2022) Target
Name:
Low molecular weight phosphotyrosine protein phosphatase
Synonyms:
3.1.3.2 Acp1 LMW-PTPase PPAC_RAT
Type:
PROTEIN
Mol. Mass.:
18151.43
Organism:
Rattus norvegicus
Description:
ChEMBL_120671
Residue:
158
  
Inhibitor
Name:
BDBM50607112
Synonyms:
CHEMBL5220114
Type:
Small organic molecule
Emp. Form.:
C12H15BrN2O5S
Mol. Mass.:
379.227
SMILES:
OS(=O)(=O)CC(=O)Nc1ccc(N2CCOCC2)c(Br)c1
: