Target
Dipeptidyl peptidase 4
Ligand
BDBM50607263
Substrate
Meas. Tech.
ChEMBL_2262448 (CHEMBL5217459)
IC50
0.160000±n/a nM
Citation
 Vivesh, naKaur, BJaglan, SRani, SBatra, YSingh, P Proline based rationally designed peptide esters against dipeptidyl peptidase-4: Highly potent anti-diabetic agents. Bioorg Med Chem Lett 76:0 (2022) Target
Name:
Dipeptidyl peptidase 4
Synonyms:
ADABP Adenosine deaminase complexing protein 2 CD_antigen=CD26 DPP4 DPPIV Dipeptidyl peptidase 4 (DPP IV) Dipeptidyl peptidase 4 (DPP4) Dipeptidyl peptidase 4 membrane form Dipeptidyl peptidase IV Dipeptidyl peptidase IV (DDP-IV) Dipeptidyl peptidase IV membrane form Dipeptidyl peptidase-IV (DPP-4) T-cell activation antigen CD26 | TP103
Type:
Enzyme
Mol. Mass.:
88271.01
Organism:
Homo sapiens (Human)
Description:
P27487
Residue:
766
  
Inhibitor
Name:
BDBM50607263
Synonyms:
CHEMBL5220594
Type:
Small organic molecule
Emp. Form.:
C23H39N3O7
Mol. Mass.:
469.5717
SMILES:
CC(C)(C)OC(=O)NCCCC[C@H](NC(=O)OC(C)(C)C)C(=O)N1CCC[C@H]1C(=O)OC=C
: