Target
Histone acetyltransferase p300
Ligand
BDBM50607596
Substrate
Meas. Tech.
ChEMBL_2262983 (CHEMBL5217994)
IC50
0.100000±n/a nM
Citation
 Tian, XSuarez, DThomson, DLi, WKing, EALaFrance, LBoehm, JBarton, LDi Marco, CMartyr, CThalji, RMedina, JKnight, SHeerding, DGao, ENartey, ECecconie, TNixon, CZhang, GBerrodin, TJPhelps, CPatel, ABai, XLind, KPrabhu, NMesser, JZhu, ZShewchuk, LReid, RGraves, APMcHugh, CMangatt, B Discovery of Proline-Based p300/CBP Inhibitors Using DNA-Encoded Library Technology in Combination with High-Throughput Screening. J Med Chem 65:14391-14408 (2022) Target
Name:
Histone acetyltransferase p300
Synonyms:
EP300 HIF1A/p300/CREB-binding protein P300
Type:
Protein
Mol. Mass.:
264223.04
Organism:
Homo sapiens (Human)
Description:
Q09472
Residue:
2414
  
Inhibitor
Name:
BDBM50607596
Synonyms:
CHEMBL5221053
Type:
Small organic molecule
Emp. Form.:
C22H22ClN5O2
Mol. Mass.:
423.895
SMILES:
Clc1ccc(cc1)C1(CCC1)C(=O)N1CCC[C@@H]1C(=O)Nc1ccc2[nH]ncc2n1
: