Target
15-hydroxyprostaglandin dehydrogenase [NAD(+)]
Ligand
BDBM50607645
Substrate
Meas. Tech.
ChEMBL_2263018 (CHEMBL5218029)
IC50
4.0±n/a nM
Citation
 Hu, BToda, KWang, XAntczak, MISmith, JGeboers, SNishikawa, GLi, HDawson, DFink, SDesai, ABWilliams, NSMarkowitz, SDReady, JM Orally Bioavailable Quinoxaline Inhibitors of 15-Prostaglandin Dehydrogenase (15-PGDH) Promote Tissue Repair and Regeneration. J Med Chem 65:15327-15343 (2022) Target
Name:
15-hydroxyprostaglandin dehydrogenase [NAD(+)]
Synonyms:
15-PGDH HPGD PGDH_HUMAN SDR36C1
Type:
Enzyme
Mol. Mass.:
28974.46
Organism:
Homo sapiens (Human)
Description:
P15428
Residue:
266
  
Inhibitor
Name:
BDBM50607645
Synonyms:
CHEMBL5219034 | US11718589, Compound 66b
Type:
Small organic molecule
Emp. Form.:
C24H22N4O2
Mol. Mass.:
398.4571
SMILES:
COc1nccc2cc(ccc12)-c1cnc2ccc(cc2n1)C(=O)N1CCCCC1
: