Target
15-hydroxyprostaglandin dehydrogenase [NAD(+)]
Ligand
BDBM50266252
Substrate
Meas. Tech.
ChEMBL_2263072 (CHEMBL5218083)
Ki
0.100000±n/a nM
Citation
 Hu, BToda, KWang, XAntczak, MISmith, JGeboers, SNishikawa, GLi, HDawson, DFink, SDesai, ABWilliams, NSMarkowitz, SDReady, JM Orally Bioavailable Quinoxaline Inhibitors of 15-Prostaglandin Dehydrogenase (15-PGDH) Promote Tissue Repair and Regeneration. J Med Chem 65:15327-15343 (2022) Target
Name:
15-hydroxyprostaglandin dehydrogenase [NAD(+)]
Synonyms:
15-PGDH HPGD PGDH_HUMAN SDR36C1
Type:
Enzyme
Mol. Mass.:
28974.46
Organism:
Homo sapiens (Human)
Description:
P15428
Residue:
266
  
Inhibitor
Name:
BDBM50266252
Synonyms:
CHEMBL4061483
Type:
Small organic molecule
Emp. Form.:
C21H20N2OS3
Mol. Mass.:
412.591
SMILES:
CCCC[S+]([O-])c1sc2nc(cc(-c3ccccc3)c2c1N)-c1cccs1
: