Target
C-C motif chemokine 2
Ligand
BDBM50607763
Substrate
Meas. Tech.
ChEMBL_2263139 (CHEMBL5218150)
IC50
50±n/a nM
Citation
 Humphreys, PGAnderson, NABamborough, PBaxter, AChung, CWCookson, RCraggs, PDDalton, TFournier, JCLGordon, LJGray, HFGray, MWGregory, RHirst, DJJamieson, CJones, KLKessedjian, HLugo, DMcGonagle, GPatel, VKPatten, CPoole, DLPrinjha, RKRamirez-Molina, CRioja, ISeal, GStafford, KAJShah, RRTape, DTheodoulou, NHTomlinson, LUkuser, SWall, IDWellaway, NWhite, G Identification and Optimization of a Ligand-Efficient Benzoazepinone Bromodomain and Extra Terminal (BET) Family Acetyl-Lysine Mimetic into the Oral Candidate Quality Molecule I-BET432. J Med Chem 65:15174-15207 (2022) Target
Name:
C-C motif chemokine 2
Synonyms:
CCL2 HC11 MCP-1 Monocyte chemoattractant protein 1 Monocyte chemotactic protein 1 SCYA2 | Small-inducible cytokine A2
Type:
PROTEIN
Mol. Mass.:
11032.44
Organism:
Homo sapiens (Human)
Description:
ChEMBL_1363188
Residue:
99
  
Inhibitor
Name:
BDBM50607763
Synonyms:
CHEMBL5218817
Type:
Small organic molecule
Emp. Form.:
C18H21N3O2
Mol. Mass.:
311.3782
SMILES:
CCOc1ccc2[C@@H](C)C(=O)N(C)C=C(c3cn(C)cn3)c2c1
: