Target
C-C motif chemokine 2
Ligand
BDBM50607768
Substrate
Meas. Tech.
ChEMBL_2263139 (CHEMBL5218150)
IC50
40±n/a nM
Citation
 Humphreys, PGAnderson, NABamborough, PBaxter, AChung, CWCookson, RCraggs, PDDalton, TFournier, JCLGordon, LJGray, HFGray, MWGregory, RHirst, DJJamieson, CJones, KLKessedjian, HLugo, DMcGonagle, GPatel, VKPatten, CPoole, DLPrinjha, RKRamirez-Molina, CRioja, ISeal, GStafford, KAJShah, RRTape, DTheodoulou, NHTomlinson, LUkuser, SWall, IDWellaway, NWhite, G Identification and Optimization of a Ligand-Efficient Benzoazepinone Bromodomain and Extra Terminal (BET) Family Acetyl-Lysine Mimetic into the Oral Candidate Quality Molecule I-BET432. J Med Chem 65:15174-15207 (2022) Target
Name:
C-C motif chemokine 2
Synonyms:
CCL2 HC11 MCP-1 Monocyte chemoattractant protein 1 Monocyte chemotactic protein 1 SCYA2 | Small-inducible cytokine A2
Type:
PROTEIN
Mol. Mass.:
11032.44
Organism:
Homo sapiens (Human)
Description:
ChEMBL_1363188
Residue:
99
  
Inhibitor
Name:
BDBM50607768
Synonyms:
CHEMBL5219602
Type:
Small organic molecule
Emp. Form.:
C18H21N3O3
Mol. Mass.:
327.3776
SMILES:
C[C@@H]1c2ccc(cc2C(=CN(C)C1=O)c1cnn(C)c1)[C@@H](O)CO
: