Target
Integrase
Ligand
BDBM50191263
Substrate
Meas. Tech.
ChEMBL_366820 (CHEMBL869095)
IC50
>100000±n/a nM
Citation
 Li, HYZawahir, ZSong, LDLong, YQNeamati, N Sequence-based design and discovery of peptide inhibitors of HIV-1 integrase: insight into the binding mode of the enzyme. J Med Chem 49:4477-86 (2006)  
Target
Name:
Integrase
Synonyms:
Human immunodeficiency virus type 1 integrase
Type:
PROTEIN
Mol. Mass.:
32231.48
Organism:
Human immunodeficiency virus 1
Description:
ChEMBL_90865
Residue:
288
  
Inhibitor
Name:
BDBM50191263
Synonyms:
CHEMBL377022 | IKQEF-NH2
Type:
Small organic molecule
Emp. Form.:
C31H50N8O8
Mol. Mass.:
662.7775
SMILES:
CC[C@H](C)[C@H](N)C(=O)N[C@@H](CCCCN)C(=O)N[C@@H](CCC(N)=O)C(=O)N[C@@H](CCC(O)=O)C(=O)N[C@@H](Cc1ccccc1)C(N)=O
: