Target
Melanocyte-stimulating hormone receptor
Ligand
BDBM50189018
Substrate
Meas. Tech.
ChEMBL_376971 (CHEMBL853374)
Ki
13±n/a nM
Citation
 Tian, XField, TBSwitzer, AGMazur, AWEbetino, FHWos, JABerberich, SMJayasinghe, LRObringer, CMDowty, MEPinney, BBFarmer, JACrossdoersen, DSheldon, RJ Design, synthesis, and evaluation of proline and pyrrolidine based melanocortin receptor agonists. A conformationally restricted dipeptide mimic approach. J Med Chem 49:4745-61 (2006)  
Target
Name:
Melanocyte-stimulating hormone receptor
Synonyms:
MC1-R MSH-R MSHR_HUMAN Melanocortin receptor (M1 and M4) Melanocortin receptor 1 (MC1-R) | Melanocortin receptor 1 (MC1R)
Type:
Enzyme
Mol. Mass.:
34717.23
Organism:
Homo sapiens (Human)
Description:
Q01726
Residue:
317
  
Inhibitor
Name:
BDBM50189018
Synonyms:
(S)-2-{(R)-2-[(S)-2-acetylamino-3-(3H-imidazol-4-yl)-propionylamino]-3-phenyl-propionylamino}-5-guanidino-pentanoic acid ((S)-1-methylcarbamoyl-2-naphthalen-2-yl-ethyl)-amide CHEMBL211699
Type:
Small organic molecule
Emp. Form.:
C37H46N10O5
Mol. Mass.:
710.8251
SMILES:
CNC(=O)[C@H](Cc1ccc2ccccc2c1)NC(=O)[C@H](CCCN=C(N)N)NC(=O)[C@@H](Cc1ccccc1)NC(=O)[C@H](Cc1cnc[nH]1)NC(C)=O
: