Target
Peroxisome proliferator-activated receptor gamma
Ligand
BDBM50193732
Substrate
Meas. Tech.
ChEMBL_424080 (CHEMBL855083)
IC50
330±n/a nM
Citation
 Hopkins, CRO'neil, SVLaufersweiler, MCWang, YPokross, MMekel, MEvdokimov, AWalter, RKontoyianni, MPetrey, MESabatakos, GRoesgen, JTRichardson, EDemuth, TP Design and synthesis of novel N-sulfonyl-2-indole carboxamides as potent PPAR-gamma binding agents with potential application to the treatment of osteoporosis. Bioorg Med Chem Lett 16:5659-63 (2006)  
Target
Name:
Peroxisome proliferator-activated receptor gamma
Synonyms:
NR1C3 PPAR-gamma PPARG_HUMAN Peroxisome proliferator-activated receptor gamma (PPAR gamma) Peroxisome proliferator-activated receptor gamma (PPARĪ³) peroxisome proliferator-activated receptor gamma isoform 2
Type:
Nuclear Receptor
Mol. Mass.:
57613.46
Organism:
Homo sapiens (Human)
Description:
P37231
Residue:
505
  
Inhibitor
Name:
BDBM50193732
Synonyms:
1-(4-tert-butylbenzyl)-N-(3-(trifluoromethyl)phenylsulfonyl)-1H-indole-2-carboxamide | CHEMBL218841
Type:
Small organic molecule
Emp. Form.:
C27H25F3N2O3S
Mol. Mass.:
514.559
SMILES:
CC(C)(C)c1ccc(Cn2c(cc3ccccc23)C(=O)NS(=O)(=O)c2cccc(c2)C(F)(F)F)cc1
: