Target
Glutamate receptor 1
Ligand
BDBM50194114
Substrate
Meas. Tech.
ChEMBL_403339 (CHEMBL869260)
Ki
37±n/a nM
Citation
 Andersen, TFTikhonov, DBBølcho, UBolshakov, KNelson, JKPluteanu, FMellor, IREgebjerg, JStrømgaard, K Uncompetitive antagonism of AMPA receptors: Mechanistic insights from studies of polyamine toxin derivatives. J Med Chem 49:5414-23 (2006)  
Target
Name:
Glutamate receptor 1
Synonyms:
AMPA-selective glutamate receptor 1 GluA1 GluR-A Glur1 Gria1
Type:
Protein
Mol. Mass.:
101583.91
Organism:
Rattus norvegicus (Rat)
Description:
P19490
Residue:
907
  
Inhibitor
Name:
BDBM50194114
Synonyms:
(S)-N-(1-(9-(6-aminohexylamino)nonylamino)-3-(4-hydroxyphenyl)-1-oxopropan-2-yl)butyramide | CHEMBL213582
Type:
Small organic molecule
Emp. Form.:
C28H50N4O3
Mol. Mass.:
490.7216
SMILES:
CCCC(=O)N[C@@H](Cc1ccc(O)cc1)C(=O)NCCCCCCCCCNCCCCCCN
: