Target
Cannabinoid receptor 1
Ligand
BDBM50140224
Substrate
Meas. Tech.
ChEMBL_415682 (CHEMBL853846)
Ki
30±n/a nM
Citation
 Hurst, DUmejiego, ULynch, DSeltzman, HHyatt, SRoche, MMcAllister, SFleischer, DKapur, AAbood, MShi, SJones, JLewis, DReggio, P Biarylpyrazole inverse agonists at the cannabinoid CB1 receptor: importance of the C-3 carboxamide oxygen/lysine3.28(192) interaction. J Med Chem 49:5969-87 (2006)  
Target
Name:
Cannabinoid receptor 1
Synonyms:
CANN6 CB-R CNR CNR1_HUMAN Cannabinoid receptor Cannabinoid receptor 1 (brain)
Type:
G Protein-Coupled Receptor (GPCR)
Mol. Mass.:
52868.96
Organism:
Homo sapiens (Human)
Description:
P21554
Residue:
472
  
Inhibitor
Name:
BDBM50140224
Synonyms:
5-(4-Chloro-phenyl)-1-(2,4-dichloro-phenyl)-4-methyl-1H-pyrazole-3-carboxylic acid cyclohexyl-methyl-amide CHEMBL15478
Type:
Small organic molecule
Emp. Form.:
C24H24Cl3N3O
Mol. Mass.:
476.826
SMILES:
CN(C1CCCCC1)C(=O)c1nn(c(c1C)-c1ccc(Cl)cc1)-c1ccc(Cl)cc1Cl
: