Target
Cannabinoid receptor 1
Ligand
BDBM50114673
Substrate
Meas. Tech.
ChEMBL_415683 (CHEMBL853847)
Ki
3.7±n/a nM
Citation
 Hurst, DUmejiego, ULynch, DSeltzman, HHyatt, SRoche, MMcAllister, SFleischer, DKapur, AAbood, MShi, SJones, JLewis, DReggio, P Biarylpyrazole inverse agonists at the cannabinoid CB1 receptor: importance of the C-3 carboxamide oxygen/lysine3.28(192) interaction. J Med Chem 49:5969-87 (2006)  
Target
Name:
Cannabinoid receptor 1
Synonyms:
CANN6 CB-R CNR CNR1_HUMAN Cannabinoid receptor Cannabinoid receptor 1 (brain)
Type:
G Protein-Coupled Receptor (GPCR)
Mol. Mass.:
52868.96
Organism:
Homo sapiens (Human)
Description:
P21554
Residue:
472
  
Inhibitor
Name:
BDBM50114673
Synonyms:
5-(4-Chloro-phenyl)-1-(2,4-dichloro-phenyl)-4-methyl-1H-pyrazole-3-carboxylic acid cyclohexylamide CHEMBL15874
Type:
Small organic molecule
Emp. Form.:
C23H22Cl3N3O
Mol. Mass.:
462.799
SMILES:
Cc1c(nn(c1-c1ccc(Cl)cc1)-c1ccc(Cl)cc1Cl)C(=O)NC1CCCCC1
: