Target
Cannabinoid receptor 1
Ligand
BDBM50195532
Substrate
Meas. Tech.
ChEMBL_415683 (CHEMBL853847)
Ki
19±n/a nM
Citation
 Hurst, DUmejiego, ULynch, DSeltzman, HHyatt, SRoche, MMcAllister, SFleischer, DKapur, AAbood, MShi, SJones, JLewis, DReggio, P Biarylpyrazole inverse agonists at the cannabinoid CB1 receptor: importance of the C-3 carboxamide oxygen/lysine3.28(192) interaction. J Med Chem 49:5969-87 (2006)  
Target
Name:
Cannabinoid receptor 1
Synonyms:
CANN6 CB-R CNR CNR1_HUMAN Cannabinoid receptor Cannabinoid receptor 1 (brain)
Type:
G Protein-Coupled Receptor (GPCR)
Mol. Mass.:
52868.96
Organism:
Homo sapiens (Human)
Description:
P21554
Residue:
472
  
Inhibitor
Name:
BDBM50195532
Synonyms:
5-(4-chlorophenyl)-1-(2,4-dichlorophenyl)-4-methyl-3-[(E)-piperidinoiminomethyl]-1H-pyrazole | CHEMBL385768
Type:
Small organic molecule
Emp. Form.:
C22H21Cl3N4
Mol. Mass.:
447.788
SMILES:
Cc1c(\C=N\N2CCCCC2)nn(c1-c1ccc(Cl)cc1)-c1ccc(Cl)cc1Cl
: