Target
Melanin-concentrating hormone receptor 1
Ligand
BDBM50200742
Substrate
Meas. Tech.
ChEMBL_421482 (CHEMBL854911)
Ki
15±n/a nM
Citation
 Meyers, KMMéndez-Andino, JColson, AOHu, XEWos, JAMitchell, MCHodge, KHoward, JParis, JLDowty, MEObringer, CMReizes, O Novel pyrazolopiperazinone- and pyrrolopiperazinone-based MCH-R1 antagonists. Bioorg Med Chem Lett 17:657-61 (2007)  
Target
Name:
Melanin-concentrating hormone receptor 1
Synonyms:
G-protein coupled receptor 24 MCH receptor 1 MCH-R1 MCHR-1 MCHR1_HUMAN Melanin-Concentrating Hormone Receptor 1 (MCH1R) Melanin-concentrating hormone receptor 1 (MCH-1) Melanin-concentrating hormone receptor 1 (MCHR-1) SLC-1 Somatostatin receptor-like protein
Type:
G Protein-Coupled Receptor (GPCR)
Mol. Mass.:
45976.27
Organism:
Homo sapiens (Human)
Description:
Membranes from CHO-K1 cells stably expressing human MCH1R were used in assays.
Residue:
422
  
Inhibitor
Name:
BDBM50200742
Synonyms:
7-(4-fluorophenethyl)-2-(4-(piperidin-1-ylmethyl)phenethyl)-3,4-dihydropyrrolo[1,2-a]pyrazin-1(2H)-one | CHEMBL450942
Type:
Small organic molecule
Emp. Form.:
C29H34FN3O
Mol. Mass.:
459.5982
SMILES:
Fc1ccc(CCc2cc3C(=O)N(CCc4ccc(CN5CCCCC5)cc4)CCn3c2)cc1
: