Target
Mu-type opioid receptor
Ligand
BDBM50207195
Substrate
Meas. Tech.
ChEMBL_443020 (CHEMBL892150)
Ki
0.99±n/a nM
Citation
 Balboni, GOnnis, VCongiu, CZotti, MSasaki, YAmbo, ABryant, SDJinsmaa, YLazarus, LHLazzari, ITrapella, CSalvadori, S Further studies on the effect of lysine at the C-terminus of the Dmt-Tic opioid pharmacophore. Bioorg Med Chem 15:3143-51 (2007)  
Target
Name:
Mu-type opioid receptor
Synonyms:
MOR-1 Mu-type opioid receptor (MOR) OPRM_RAT Opioid receptor B Ror-b
Type:
G Protein-Coupled Receptor (GPCR)
Mol. Mass.:
44503.11
Organism:
Rattus norvegicus (rat)
Description:
Competition binding assays were carried out using membrane preparations from transfected HN9.10 cells that constitutively expressed the mu opioid receptor.
Residue:
398
  
Inhibitor
Name:
BDBM50207195
Synonyms:
(S)-N-((S)-5-acetamido-5-(1H-benzo[d]imidazol-2-yl)pentyl)-2-((S)-2-amino-3-(4-hydroxy-2,6-dimethylphenyl)propanoyl)-1,2,3,4-tetrahydroisoquinoline-3-carboxamide | CHEMBL397357
Type:
Small organic molecule
Emp. Form.:
C35H42N6O4
Mol. Mass.:
610.7458
SMILES:
CC(=O)N[C@@H](CCCCNC(=O)[C@@H]1Cc2ccccc2CN1C(=O)[C@@H](N)Cc1c(C)cc(O)cc1C)c1nc2ccccc2[nH]1
: