Target
Fatty acid-binding protein, adipocyte
Ligand
BDBM50212882
Substrate
Meas. Tech.
ChEMBL_455933 (CHEMBL887934)
Ki
28±n/a nM
Citation
 Sulsky, RMagnin, DRHuang, YSimpkins, LTaunk, PPatel, MZhu, YStouch, TRBassolino-Klimas, DParker, RHarrity, TStoffel, RTaylor, DSLavoie, TBKish, KJacobson, BLSheriff, SAdam, LPEwing, WRRobl, JA Potent and selective biphenyl azole inhibitors of adipocyte fatty acid binding protein (aFABP). Bioorg Med Chem Lett 17:3511-5 (2007)  
Target
Name:
Fatty acid-binding protein, adipocyte
Synonyms:
A-FABP ALBP FABP4 Fatty acid binding protein adipocyte Fatty acid-binding protein 4 (FABP4)
Type:
Enzyme
Mol. Mass.:
14719.23
Organism:
Homo sapiens (Human)
Description:
P15090
Residue:
132
  
Inhibitor
Name:
BDBM50212882
Synonyms:
CHEMBL248120 | [2'-(5-ethyl-3,4-diphenyl-pyrazol-1-yl)-biphenyl-3-yl]-hydroxy-acetic acid
Type:
Small organic molecule
Emp. Form.:
C31H26N2O3
Mol. Mass.:
474.5497
SMILES:
CCc1c(c(nn1-c1ccccc1-c1cccc(c1)C(O)C(O)=O)-c1ccccc1)-c1ccccc1
: