Target
Matrix metalloproteinase-14
Ligand
BDBM50213419
Substrate
Meas. Tech.
ChEMBL_447908 (CHEMBL898158)
IC50
53100±n/a nM
Citation
 Moroy, GDenhez, CEl Mourabit, HToribio, ADassonville, ADecarme, MRenault, JHMirand, CBellon, GSapi, JAlix, AJHornebeck, WBourguet, E Simultaneous presence of unsaturation and long alkyl chain at P'1 of Ilomastat confers selectivity for gelatinase A (MMP-2) over gelatinase B (MMP-9) inhibition as shown by molecular modelling studies. Bioorg Med Chem 15:4753-66 (2007)  
Target
Name:
Matrix metalloproteinase-14
Synonyms:
MMP-14 MMP14 MT-MMP 1 MT1MMP Matrix Metalloproteinase-14 (MMP-14) Matrix metalloproteinase-14 Membrane-type matrix metalloproteinase 1 | Membrane-type-1 matrix metalloproteinase
Type:
Protein
Mol. Mass.:
65900.19
Organism:
Homo sapiens (Human)
Description:
P50281
Residue:
582
  
Inhibitor
Name:
BDBM50213419
Synonyms:
(2E)-3-(N-hydroxycarbamoyl)-2-(3-phenylpropylidene)propionyl-L-tryptophan-N-methylamide | CHEMBL401445
Type:
Small organic molecule
Emp. Form.:
C25H28N4O4
Mol. Mass.:
448.5142
SMILES:
CNC(=O)[C@H](Cc1c[nH]c2ccccc12)NC(=O)C(CC(=O)NO)=CCCc1ccccc1
: