Target
Matrix metalloproteinase-9
Ligand
BDBM50135601
Substrate
Meas. Tech.
ChEMBL_447907 (CHEMBL898157)
IC50
17±n/a nM
Citation
 Moroy, GDenhez, CEl Mourabit, HToribio, ADassonville, ADecarme, MRenault, JHMirand, CBellon, GSapi, JAlix, AJHornebeck, WBourguet, E Simultaneous presence of unsaturation and long alkyl chain at P'1 of Ilomastat confers selectivity for gelatinase A (MMP-2) over gelatinase B (MMP-9) inhibition as shown by molecular modelling studies. Bioorg Med Chem 15:4753-66 (2007)  
Target
Name:
Matrix metalloproteinase-9
Synonyms:
67 kDa matrix metalloproteinase-9 92 kDa gelatinase CLG4B Gelatinase B MMP9 Matrix metalloproteinase 9 (MMP-9) Matrix metalloproteinase-9 (MMP9)
Type:
Enzyme
Mol. Mass.:
78452.28
Organism:
Homo sapiens (Human)
Description:
P14780
Residue:
707
  
Inhibitor
Name:
BDBM50135601
Synonyms:
(S,E)-N1-(3-(1H-indol-3-yl)-1-(methylamino)-1-oxopropan-2-yl)-N4-hydroxy-2-(2-methylpropylidene)succinamide 1 N*4*-Hydroxy-N*1*-[(S)-2-(1H-indol-3-yl)-1-methylcarbamoyl-ethyl]-2-[2-methyl-prop-(E)-ylidene]-succinamide
Type:
Small organic molecule
Emp. Form.:
C20H26N4O4
Mol. Mass.:
386.4448
SMILES:
CNC(=O)[C@H](Cc1c[nH]c2ccccc12)NC(=O)C(\CC(=O)NO)=C\C(C)C
: