Target
Matrix metalloproteinase-9
Ligand
BDBM50213417
Substrate
Meas. Tech.
ChEMBL_447907 (CHEMBL898157)
IC50
974±n/a nM
Citation
 Moroy, GDenhez, CEl Mourabit, HToribio, ADassonville, ADecarme, MRenault, JHMirand, CBellon, GSapi, JAlix, AJHornebeck, WBourguet, E Simultaneous presence of unsaturation and long alkyl chain at P'1 of Ilomastat confers selectivity for gelatinase A (MMP-2) over gelatinase B (MMP-9) inhibition as shown by molecular modelling studies. Bioorg Med Chem 15:4753-66 (2007)  
Target
Name:
Matrix metalloproteinase-9
Synonyms:
67 kDa matrix metalloproteinase-9 92 kDa gelatinase CLG4B Gelatinase B MMP9 Matrix metalloproteinase 9 (MMP-9) Matrix metalloproteinase-9 (MMP9)
Type:
Enzyme
Mol. Mass.:
78452.28
Organism:
Homo sapiens (Human)
Description:
P14780
Residue:
707
  
Inhibitor
Name:
BDBM50213417
Synonyms:
(2E)-3-(N-hydroxycarbamoyl)-2-[(2E)-but-2-en-1-ylidene]propionyl-L-tryptophan-N-methylamide | CHEMBL237078
Type:
Small organic molecule
Emp. Form.:
C20H24N4O4
Mol. Mass.:
384.429
SMILES:
CNC(=O)[C@H](Cc1c[nH]c2ccccc12)NC(=O)C(CC=CC)=CC(=O)NO
: