Target
Stromelysin-1
Ligand
BDBM50135601
Substrate
Meas. Tech.
ChEMBL_447906 (CHEMBL898156)
IC50
179±n/a nM
Citation
 Moroy, GDenhez, CEl Mourabit, HToribio, ADassonville, ADecarme, MRenault, JHMirand, CBellon, GSapi, JAlix, AJHornebeck, WBourguet, E Simultaneous presence of unsaturation and long alkyl chain at P'1 of Ilomastat confers selectivity for gelatinase A (MMP-2) over gelatinase B (MMP-9) inhibition as shown by molecular modelling studies. Bioorg Med Chem 15:4753-66 (2007)  
Target
Name:
Stromelysin-1
Synonyms:
MMP-3 MMP3_HUMAN Matrix metalloproteinase 3 Matrix metalloproteinase-3 (MMP-3) SL-1 Stromelysin 1 | Transin-1
Type:
Enzyme
Mol. Mass.:
53973.13
Organism:
Homo sapiens (Human)
Description:
P08254
Residue:
477
  
Inhibitor
Name:
BDBM50135601
Synonyms:
(S,E)-N1-(3-(1H-indol-3-yl)-1-(methylamino)-1-oxopropan-2-yl)-N4-hydroxy-2-(2-methylpropylidene)succinamide 1 N*4*-Hydroxy-N*1*-[(S)-2-(1H-indol-3-yl)-1-methylcarbamoyl-ethyl]-2-[2-methyl-prop-(E)-ylidene]-succinamide
Type:
Small organic molecule
Emp. Form.:
C20H26N4O4
Mol. Mass.:
386.4448
SMILES:
CNC(=O)[C@H](Cc1c[nH]c2ccccc12)NC(=O)C(\CC(=O)NO)=C\C(C)C
: