Target
Neutrophil collagenase
Ligand
BDBM50213418
Substrate
Meas. Tech.
ChEMBL_447909 (CHEMBL898159)
IC50
101±n/a nM
Citation
 Moroy, GDenhez, CEl Mourabit, HToribio, ADassonville, ADecarme, MRenault, JHMirand, CBellon, GSapi, JAlix, AJHornebeck, WBourguet, E Simultaneous presence of unsaturation and long alkyl chain at P'1 of Ilomastat confers selectivity for gelatinase A (MMP-2) over gelatinase B (MMP-9) inhibition as shown by molecular modelling studies. Bioorg Med Chem 15:4753-66 (2007)  
Target
Name:
Neutrophil collagenase
Synonyms:
CLG1 MMP8 Matrix metalloproteinase-8 PMNL collagenase | PMNL-CL
Type:
Enzyme
Mol. Mass.:
53413.48
Organism:
Homo sapiens (Human)
Description:
P22894
Residue:
467
  
Inhibitor
Name:
BDBM50213418
Synonyms:
(2E)-3-(N-hydroxycarbamoyl)-2-heptylidenepropionyl-L-tryptophan-N-methylamide | CHEMBL236446
Type:
Small organic molecule
Emp. Form.:
C23H32N4O4
Mol. Mass.:
428.5246
SMILES:
CCCCCC\C=C(/CC(=O)NO)C(=O)N[C@@H](Cc1c[nH]c2ccccc12)C(=O)NC
: